{"text_format":"1","workbook":"xlsx","n_sheets":9,"sheets":["Instructions","Summary","Encumbrances","Addt'l Bdgt","Exp Forecasting","Other Expenses","Appt Info DataDump","Budget Detail DataDump","Expense Detail DataDump"],"not_rendered":{"charts":0,"images":0,"macros":1,"external_links":1,"defined_names":63,"comments":3,"pivot_tables":0},"unopened":[],"bounds":{"document_bytes":16777216,"sheet_cells":100000,"rows_first":2000,"rows_last":500,"rows_between":2000,"halvings":0,"cell_chars":16384,"cell_head_chars":4096},"cells_cut":0,"cells_raw":0,"read":"whole","date_system":"1900"}

{"sheet":"Instructions","index":0,"n_rows":38,"n_cols":3,"rows_kept":38,"cut":false,"hidden":false,"merged":[]}
["Forecasting Tool Instructions"]
[]
[]
["Use the latest Forecasting Template and save to your computer or shared drive",null,"Link to Sponsored Programs site to obtain latest Forecasting Template  (under Forms)"]
["Run the Business Objects query ",null,"Follow directions listed within the \"Post-Award Procedures Manual\" for using the Business Objects Query"]
[]
["Paste the information into the \"Appt Info DataDump\", \"Budget Detail DataDump\", & Expense Detail DataDump\" tabs"]
[null,"This data will fill in various sections of the \"Summary\" & \"Exp Forecasting\" tabs"]
["Parent P/G & sub-accounts"]
[null,"If you have a project with sub-accounts, you can repeat the Business Objects Query for each sub-account and paste the information directly below the previous datadump per tab.  NOTE:  When you have data dumps from several p/g #s, you will need to manually override the Statement Balance (cell L6) on the \"Exp Forecasting\" tab to reflect the Statement Balance of the entire project (use the total # from M-Reports that includes parent p/g & subs)"]
[]
["Verify DataDump #'s"]
[null,"Using M-Reports as a reference, it is a good idea to verify the #'s in M-Reports (Parent summary if more than one p/g#) match the Forecasting information on the Summary tab (Columns labeled A & B)"]
[null,"If you are adding more than 1 p/g data to this forecasting tool, you will need to combine the statement balances in cell L6 on the \"Exp Forecasting\" tab"]
[]
{"$rows_left_out":24}
{"sheet":"Summary","index":1,"n_rows":89,"n_cols":27,"rows_kept":89,"cut":false,"hidden":false,"merged":[[11,22,11,24],[12,22,12,24],[13,22,13,24],[10,14,11,14]]}
[null,null,null,null,null,null,null,null,null,null,null,null,null,null,null,null,null,null,null,null," "," ",null," ",null,null," "]
[null,null,null," Total charges to date as of ( if not the same as the budget end date)",null,null,null,null,null,null,null,null,null,null,null,null,null,null,null,null," "," ",null," ",null,null," "]
[null,null,null,null,null,null,null,null,null,null,null,null,null,null,null,null,null,null,null,null," "," ",null," ",null,null," "]
[null,"Forecasting Summary",null,null,null,null,null,null,null,null,null,null,null,null,null,null,null,null,null,null,"forecasting template prepared on :"," ",null," ",null,null," "]
[null,"PG:",{"$f":"'Exp Forecasting'!B3","v":"PASTE HERE"},null,null,null,null,null,null,{"$f":"'Exp Forecasting'!C3","v":0},null,null,null,null,null,null,null,null,null,null,{"$f":"NOW()","v":"2017-01-26T14:23:52.620"}," ",null," ",null,null," "]
[null,"PI:",{"$f":"'Appt Info DataDump'!O2","v":0},null,null,null,null,null,null,null,null,null,null,null,null,null,null,null,null,null,null," ",null," ",null,null," "]
[null,"Start/End Date:",{"$f":"'Appt Info DataDump'!P2","v":"00:00:00"},"-",{"$f":"'Appt Info DataDump'!D2","v":"00:00:00"},null,null,null,null,null,null,null,null,null,null,null,null,null,null,null,null," ",null," ",null,null," "]
[null,"Bdgt Pd Start/End Date:",{"$f":"'Appt Info DataDump'!Q2","v":"00:00:00"},"-",{"$f":"'Appt Info DataDump'!R2","v":"00:00:00"},null,null,null,null,null,null,null,null,null,null,null,null,null,null,null,null," ",null," ",null,null," "]
[null,null,null,null,null,null,null,null,null,null,null,null,null,null,null,null,null,null,null,null,null," ",null," ",null,null," "]
[null,null,null,null,"(A)",null,"(B)",null,"PREVIOUSLY",null,"(C)",null,"(D-1)",null,"(D-2)",null,"(E)",null,"(E)",null,null," ",null," ",null,null," "]
[null,null,null,null,"CURRENT",null,"TOTAL CHARGES",null,"REPORTED",null,"ADDITIONAL",null,"CURRENT M-REPORTS",null,"PROPOSED ENCUMBRANCES",null,"TOTAL EXPENSES+",null,"TOTAL EXPENSES+",null,"BALANCE"," ",null," ",null,null," "]
[null,"BUDGET CATEGORY",null,null,"BUDGET",null,"TO DATE",null,"CHARGES",null,"BUDGET",null,"ENCUMBRANCES",null,null,null,"PROJECTIONS (B+D)",null,"PROJECTIONS (B+D1+D2)",null,"(A+C-E)"," ",null,null,null,null," "]
[null,"Salaries & Wages",null,null,{"$f":"'Budget Detail DataDump'!G$108","v":0},null,{"$f":"'Expense Detail DataDump'!G1008","v":0},null,0,null,{"$f":"'Addt''l Bdgt'!E5+'Addt''l Bdgt'!G5+'Addt''l Bdgt'!I5+'Addt''l Bdgt'!K5","v":0},null,{"$f":"+Encumbrances!F3","v":0},null,{"$f":"'Exp Forecasting'!L30+'Exp Forecasting'!Q30+'Exp Forecasting'!U30+'Exp Forecasting'!Y30+'Exp Forecasting'!AC30","v":0},null,{"$f":"ROUND(SUM(G13-I13+O13),2)","v":0},null,{"$f":"ROUND(G13+M13+O13,2)","v":0},null,{"$f":"ROUND(E13+K13-S13,2)","v":0}," ",null,null,null,null," "]
[null,"Admin Salaries (A-21 Monitored)",null,null,{"$f":"'Budget Detail DataDump'!H$108","v":0},null,{"$f":"'Expense Detail DataDump'!H1008","v":0},null,0,null,{"$f":"'Addt''l Bdgt'!E6+'Addt''l Bdgt'!G6+'Addt''l Bdgt'!I6+'Addt''l Bdgt'!K6","v":0},null,{"$f":"+Encumbrances!F4","v":0},null,{"$f":"[1]Encumb!K$118","v":0},null,{"$f":"ROUND(SUM(G14-I14+O14),2)","v":0},null,{"$f":"ROUND(G14+M14+O14,2)","v":0},null,{"$f":"ROUND(E14+K14-S14,2)","v":0}," ",null,null,null,null," "]
[null,"Clerical Salaries",null,null,{"$f":"'Budget Detail DataDump'!I108","v":0},null,{"$f":"'Expense Detail DataDump'!I1008","v":0},null,0,null,{"$f":"'Addt''l Bdgt'!E7+'Addt''l Bdgt'!G7+'Addt''l Bdgt'!I7+'Addt''l Bdgt'!K7","v":0},null,{"$f":"+Encumbrances!F5","v":0},null,{"$f":"[1]Encumb!L$118","v":0},null,0,null,0,null,0," ",null," ",null,null," "]
{"$rows_left_out":75}
{"sheet":"Encumbrances","index":2,"n_rows":38,"n_cols":7,"rows_kept":38,"cut":false,"hidden":false,"merged":[[0,0,0,3]]}
["Using the RTF information in M-Reports, Input information from the blue columns labeled \"Expended since last month closed...\", \"Payroll/Fin Aid Commitments\" &  \"Purchasing Commitment\"s columns into the \"Encumbrances tab\"  (if you have sub-accounts, you will need to add their encumbrances as well)"]
["BUDGET CATEGORY","Expended since last month closed (excluding Payroll/Fin Aid)","Payroll/Fin Aid Commitments","Purchasing Commitments","Other Unit Commitments"]
["Salaries & Wages",null,0,null,0,{"$f":"SUM(B3:E3)","v":0}]
["Admin Salaries (A-21 Monitored)",null,0,null,0,{"$f":"SUM(B4:E4)","v":0}]
["Clerical Salaries",null,0,null,0,0]
["SRO Salaries",null,0,null,0,0]
["Fringe Benefits",null,0,null,0,0]
["Tuition Waiver",0,null,0,0,0]
["Consultants",0,null,0,0,0]
["Respondents/Subjects",0,null,0,0,0]
["Stipends",0,null,0,0,0]
["Student Aid",0,null,0,0,0]
["Patient Care",0,null,0,0,0]
["General Supplies (A21 Monitored)",0,null,0,0,0]
["Research Supplies & Services",0,null,0,0,0]
{"$rows_left_out":24}
{"sheet":"Addt'l Bdgt","index":3,"n_rows":40,"n_cols":14,"rows_kept":40,"cut":false,"hidden":false,"merged":[]}
[null,"Budget Start Date",{"$f":"+'Exp Forecasting'!E12","v":"00:00:00"}]
[null,"Budget End Date",{"$f":"+'Exp Forecasting'!G12","v":"00:00:00"}]
[null,null,{"$f":"Summary!E11","v":"CURRENT"},null,"Addt'l Bdgt",null,"Addt'l Bdgt",null,"Addt'l Bdgt",null,"Addt'l Bdgt",null,null,"All Years"]
[null,{"$f":"Summary!B12","v":"BUDGET CATEGORY"},{"$f":"Summary!E12","v":"BUDGET"},null,{"$f":"+'Exp Forecasting'!P6","v":"Year 2"},null,{"$f":"+'Exp Forecasting'!T6","v":"Year 3"},null,{"$f":"+'Exp Forecasting'!X6","v":"Year 4"},null,{"$f":"+'Exp Forecasting'!AB6","v":"Year 5"},null,null," Combined"]
[null,{"$f":"Summary!B13","v":"Salaries & Wages"},{"$f":"Summary!E13","v":0},null,0,null,0,null,0,null,0,null,null,{"$f":"SUM(C5:K5)","v":0}]
[null,{"$f":"Summary!B14","v":"Admin Salaries (A-21 Monitored)"},{"$f":"Summary!E14","v":0},null,0,null,0,null,0,null,0,null,null,0]
[null,{"$f":"Summary!B15","v":"Clerical Salaries"},{"$f":"Summary!E15","v":0},null,0,null,0,null,0,null,0,null,null,0]
[null,{"$f":"Summary!B16","v":"SRO Salaries"},{"$f":"Summary!E16","v":0},null,0,null,0,null,0,null,0,null,null,0]
[null,{"$f":"Summary!B17","v":"Fringe Benefits"},{"$f":"Summary!E17","v":0},null,0,null,0,null,0,null,0,null,null,0]
[null,{"$f":"Summary!B18","v":"Tuition Waiver"},{"$f":"Summary!E18","v":0},null,0,null,0,null,0,null,0,null,null,0]
[null,{"$f":"Summary!B19","v":"Consultants"},{"$f":"Summary!E19","v":0},null,0,null,0,null,0,null,0,null,null,0]
[null,{"$f":"Summary!B20","v":"Respondents/Subjects"},{"$f":"Summary!E20","v":0},null,0,null,0,null,0,null,0,null,null,0]
[null,{"$f":"Summary!B21","v":"Stipends"},{"$f":"Summary!E21","v":0},null,0,null,0,null,0,null,0,null,null,0]
[null,{"$f":"Summary!B22","v":"Student Aid"},{"$f":"Summary!E22","v":0},null,0,null,0,null,0,null,0,null,null,0]
[null,{"$f":"Summary!B23","v":"Patient Care"},{"$f":"Summary!E23","v":0},null,0,null,0,null,0,null,0,null,null,0]
{"$rows_left_out":26}
{"sheet":"Exp Forecasting","index":4,"n_rows":89,"n_cols":48,"rows_kept":89,"cut":false,"hidden":false,"merged":[[85,19,85,20],[85,23,85,24],[85,27,85,28],[85,15,85,16],[10,1,10,11],[63,6,64,8],[2,7,2,8],[2,2,4,5],[1,2,1,3],[2,1,4,1],[3,13,3,28],[4,13,4,16],[4,17,4,20],[4,21,4,24],[4,25,4,28]]}
[]
[null,"P/G:","P/G Title:",null,null,null,null,"P/G End Date:"]
[null,{"$f":"'Appt Info DataDump'!B2","v":"PASTE HERE"},{"$f":"'Appt Info DataDump'!C2","v":0},null,null,null,null,{"$f":"'Appt Info DataDump'!D2","v":"00:00:00"}]
[null,null,null,null,null,null,null,null,null,null,null,null,null,"Future Budget years may not necessary be year 2, 3, 4, or 5 when you do your forecast.  These are available to forecast the next budget year of your project. "]
[null,null,null,null,null,null,null,null,null,null,null,null,null," "]
[null,"Statement Balance as of last month closed",null,null,null,null,null,null,null,null,null,{"$f":"'Appt Info DataDump'!E2","v":0},null,null,null,"Year 2",null,null,null,"Year 3",null,null,null,"Year 4",null,null,null,"Year 5"]
[null,"Forecasting template prepared on:",null,{"$f":"NOW()","v":"2017-01-26T14:23:52.620"}]
[null,"M-Reports Encumbrances (enter #'s on the \"Encumbrances\" tab)",null,null,null,null,null,null,null,null,null,{"$f":"+Encumbrances!B38+Encumbrances!C38+Encumbrances!D38+Encumbrances!E38","v":0}]
[]
[null,"M-Reports Projected Balance:",null,null,null,null,null,null,null,null,null,{"$f":"L6-L8","v":0}]
[null,"Current Budget Year",null,null,null,null,null,null,null,null,null,null,null,null,null,null,"% Increase",null,null,null,"% Increase",null,null,null,"% Increase",null,null,null,"% Increase"]
[null,"Additional Encumbrances:",null,null,{"$f":"+Summary!C8","v":"00:00:00"},"-",{"$f":"+Summary!E8","v":"00:00:00"},null,null,null,null,null,null,null,null,null,0,null,null,null,0,null,null,null,0,null,null,null,0]
[null,"Salary",null,null,"Monthly ","# of","Current","Current","NEW","New Monthly","Amount","Adj",null,"# of","New Monthly","NEW",null,"# of","New Monthly","NEW",null,"# of","New Monthly","NEW",null,"# of","New Monthly","NEW"]
[null,null,null,null,"Amount","Months","%Effort","%Dist","%Dist","Amount","Diff.","Amount",null,"Months","Amount","%Dist",null,"Months","Amount","%Dist",null,"Months","Amount","%Dist",null,"Months","Amount","%Dist",null,null,null,null,null,null,null,null,null,null,null,null,null,null,null,null,null,null,null,1]
[null,{"$f":"'Appt Info DataDump'!H2","v":0},null,null,{"$f":"'Appt Info DataDump'!M2*H15","v":0},0,{"$f":"'Appt Info DataDump'!J2","v":0},{"$f":"'Appt Info DataDump'!K2","v":0},{"$f":"H15","v":0},{"$f":"'Appt Info DataDump'!M2*I15","v":0},{"$f":"J15-E15","v":0},{"$f":"K15*F15","v":0},null,12,{"$f":"'Appt Info DataDump'!M2*P15","v":0},{"$f":"H15","v":0},{"$f":"(O15*N15)*(1+($Q$12))","v":0},12,{"$f":"'Appt Info DataDump'!M2*T15","v":0},{"$f":"P15","v":0},{"$f":"((S15*R15)*(1+($U$12)))*(1+$Q$12)","v":0},12,{"$f":"'Appt Info DataDump'!M2*X15","v":0},{"$f":"T15","v":0},{"$f":"(((V15*W15)*(1+($U$12)))*(1+$Y$12))*(1+$Q$12)","v":0},12,{"$f":"'Appt Info DataDump'!M2*AB15","v":0},{"$f":"X15","v":0},{"$f":"((((Z15*AA15)*(1+($U$12)))*(1+($Y$12))*(1+($AC$12))))*(1+$Q$12)","v":0},null,null,null,null,null,null,null,null,null,null,null,null,null,null,null,null,null,null,9]
{"$rows_left_out":75}
{"sheet":"Other Expenses","index":5,"n_rows":121,"n_cols":7,"rows_kept":121,"cut":false,"hidden":false,"merged":[]}
[{"$f":"+Instructions!B32","v":"Use this tab to list any future non-salary or fb expenditures.  These would be for those categories listed on this tab."}]
[]
[null,null,"Current Budget Year",{"$f":"+'Exp Forecasting'!P6","v":"Year 2"},{"$f":"+'Exp Forecasting'!T6","v":"Year 3"},{"$f":"+'Exp Forecasting'!X6","v":"Year 4"},{"$f":"+'Exp Forecasting'!AB6","v":"Year 5"}]
["Consultants",null,0,0,0,0,0]
[null,null,0,0,0,0,0]
[null,null,0,0,0,0,0]
[null,"TTL Consultants",{"$f":"SUM(C4:C6)","v":0},{"$f":"SUM(D4:D6)","v":0},0,0,0]
[]
["Respondents/Subjects",null,0,0,0,0,0]
[null,null,0,0,0,0,0]
[null,null,0,0,0,0,0]
[null,null,0,0,0,0,0]
[null,null,0,0,0,0,0]
[null,"TTL Respondents/Subjects",{"$f":"SUM(C9:C13)","v":0},{"$f":"SUM(D9:D13)","v":0},0,0,0]
[]
{"$rows_left_out":107}
{"sheet":"Appt Info DataDump","index":6,"n_rows":2,"n_cols":15,"rows_kept":2,"cut":false,"hidden":false,"merged":[]}
[null,null,null,null,null,null,"Emplid:","Employee:","Shortcode"," current effort","current distribution","Comp Rt Dist:","Monthly Comp Rate","FB Rate ( .xx )","PI"]
[null,"PASTE HERE"]

{"sheet":"Budget Detail DataDump","index":7,"n_rows":108,"n_cols":41,"rows_kept":108,"cut":false,"hidden":false,"merged":[]}
[]
[]
[]
["NOTE:  Paste Business Objects Query results in outlined area"]
["Use to paste budget amounts as of last DW refresh"]
["Query file location:    C:\\Public\\Reports\\FSR.rep (Use the FSR Budget Data Tab)",null,null,null,null,null,"RschSal","AdmnSal","ClrcSal","DSTSal","FB","TuitWvr","Consult","Rsp/Sbj","Stipend","StdtAid","PtCare","GenSup","RschSup","DataPrc","Postage","Telepho","PT<25K","PT>25K","Alt&Ren","TrvlDms","TrvlFrg","TrvlTrn","Hosting","Equip","Trsf","CompCtr","ULAM","OSSFac","I/C","CF  pending","Auth. Pending","Non-Spon Revenue","Unallocated","CNVPPD","Sub"]
[{"$f":"IF(AND($B108=\"\",$C108=\"\"),\" \",\"***TOO MANY ROWS DUMPED!  Please UNDO and add more rows.\")","v":" "},null,null,null,null,null,911000,911100,911200,911250,911300,911400,911500,911550,911600,911650,911700,911800,911900,911950,912000,912100,912200,912300,912400,912500,912550,912580,912590,912600,912700,912800,912900,913000,913400,999995,999996,999997,999999,"CNVPPD","Check"]
[null,"PASTE HERE",null,null,null,null,{"$f":"IF($B8=\"\",\"\",IF(G$7=$D8,$E8,\"\"))","v":""},"","","","","","","","","","","","","","","",{"$f":"IF($B8=\"\",\"\",IF(W$7=$D8,$E8,\"\"))","v":""},"","","","","","","","","","","","","","",null,{"$f":"IF($B8=\"\",\"\",IF(OR(AM$7=$D8,$D8=999998),$E8,\"\"))","v":""},"",{"$f":"IF(OR($B8=\"\",$B8='[1]Data Sheet'!$E$31),0,1)","v":1}]
[null,null,null,null,null,null,"","","","","","","","","","","","","","","","","","","","","","","","","","","","","","","",null,"","",{"$f":"IF(OR($B9=\"\",$B9='[1]Data Sheet'!$E$31),0,1)","v":0}]
[null,null,null,null,null,null,"","","","","","","","","","","","","","","","","","","",{"$f":"IF($B10=\"\",\"\",IF(Z$7=$D10,$E10,\"\"))","v":""},"","","","","","","","","","","",null,"","",{"$f":"IF(OR($B10=\"\",$B10='[1]Data Sheet'!$E$31),0,1)","v":0}]
[null,null,null,null,null,null,"","","","","","","","","","","","","","","","","","","","","","","","","","","","","","","",null,"","",{"$f":"IF(OR($B11=\"\",$B11='[1]Data Sheet'!$E$31),0,1)","v":0}]
[null,null,null,null,null,null,"","","","","","","","","","","","","","","","","","","","","","","","","","","","","","","",null,"","",{"$f":"IF(OR($B12=\"\",$B12='[1]Data Sheet'!$E$31),0,1)","v":0}]
[null,null,null,null,null,null,"","","","","","","","","","","","","","","","","","","","","","","","","","","","","","","",null,"","",{"$f":"IF(OR($B13=\"\",$B13='[1]Data Sheet'!$E$31),0,1)","v":0}]
[null,null,null,null,null,null,"","","","","","","","","","","","","","","","","","","","","","","","","","","","","","","",null,"","",{"$f":"IF(OR($B14=\"\",$B14='[1]Data Sheet'!$E$31),0,1)","v":0}]
[null,null,null,null,null,null,"","","","","","","","","","","","","","","","","","","","","","","","","","","","","","","",null,"","",{"$f":"IF(OR($B15=\"\",$B15='[1]Data Sheet'!$E$31),0,1)","v":0}]
{"$rows_left_out":94}
{"sheet":"Expense Detail DataDump","index":8,"n_rows":1008,"n_cols":39,"rows_kept":1008,"cut":false,"hidden":false,"merged":[]}
[]
[]
["NOTE:  Paste Business Objects Query in outlined area"]
["Use to paste Expense Summary info from 07/01/98 through the last month of the report period"]
["Query file location:    C:\\Public\\Reports\\FSR.rep (Use the FSR Exp Sum Tab)"]
[{"$f":"IF($B1008=\"\",\" \",\"***TOO MANY ROWS DUMPED!  Please UNDO and add more rows.\")","v":" "},null,null,null,null,null,"RschSal","AdmnSal","ClrcSal","DSTSal","FB","TuitWvr","Consult","Rsp/Sbj","Stipend","StdtAid","PtCare","GenSup","RschSup","DataPrc","Postage","Telepho","SC<25K","SC>25K","Alt&Ren","TrvlDms","TrvlFrg","Hosting","Equip","Trsf","CompCtr","ULAM","OSSFac","I/C","Fabrication","Lump Sum","Sub","Fabrication","GSRA"]
[null,null,null,null,null,null,911000,911100,911200,911250,911300,911400,911500,911550,911600,911650,911700,911800,911900,911950,912000,912100,912200,912300,912400,912500,912550,912590,912600,912700,912800,912900,913000,913400,"Check","Check","Check","Amount","Check"]
[null,"PASTE HERE",null,null,null,{"$f":"IF(OR(B8=\"\",B8=\"paste here\"),\" \",VLOOKUP(C8,account,11))","v":" "},{"$f":"IF(F8=\"\",\"\",IF(F8=$G$7,D8,\"\"))","v":""},{"$f":"IF(F8=\"\",\"\",IF(F8=$H$7,D8,\"\"))","v":""},{"$f":"IF(F8=\"\",\"\",IF(F8=$I$7,D8,\"\"))","v":""},{"$f":"IF(F8=\"\",\"\",IF(F8=$J$7,D8,\"\"))","v":""},{"$f":"IF(F8=\"\",\"\",IF(F8=$K$7,D8,\"\"))","v":""},{"$f":"IF(F8=\"\",\"\",IF(F8=$L$7,D8,\"\"))","v":""},{"$f":"IF(F8=\"\",\"\",IF(F8=$M$7,D8,\"\"))","v":""},{"$f":"IF(F8=\"\",\"\",IF(F8=$N$7,D8,\"\"))","v":""},{"$f":"IF(F8=\"\",\"\",IF(F8=$O$7,D8,\"\"))","v":""},{"$f":"IF(F8=\"\",\"\",IF(F8=$P$7,D8,\"\"))","v":""},{"$f":"IF(F8=\"\",\"\",IF(F8=$Q$7,D8,\"\"))","v":""},{"$f":"IF(F8=\"\",\"\",IF(F8=$R$7,D8,\"\"))","v":""},{"$f":"IF(F8=\"\",\"\",IF(F8=$S$7,D8,\"\"))","v":""},{"$f":"IF(F8=\"\",\"\",IF(F8=$T$7,D8,\"\"))","v":""},{"$f":"IF(F8=\"\",\"\",IF(F8=$U$7,D8,\"\"))","v":""},{"$f":"IF(F8=\"\",\"\",IF(F8=$V$7,D8,\"\"))","v":""},{"$f":"IF(F8=\"\",\"\",IF(F8=$W$7,D8,\"\"))","v":""},{"$f":"IF(F8=\"\",\"\",IF(F8=$X$7,D8,\"\"))","v":""},{"$f":"IF(F8=\"\",\"\",IF(F8=$Y$7,D8,\"\"))","v":""},{"$f":"IF(F8=\"\",\"\",IF(F8=$Z$7,D8,\"\"))","v":""},{"$f":"IF(F8=\"\",\"\",IF(F8=$AA$7,D8,\"\"))","v":""},{"$f":"IF(F8=\"\",\"\",IF(F8=$AB$7,D8,\"\"))","v":""},{"$f":"IF(F8=\"\",\"\",IF(F8=$AC$7,D8,\"\"))","v":""},{"$f":"IF(F8=\"\",\"\",IF(F8=$AD$7,D8,\"\"))","v":""},{"$f":"IF(F8=\"\",\"\",IF(F8=$AE$7,D8,\"\"))","v":""},{"$f":"IF(F8=\"\",\"\",IF(F8=$AF$7,D8,\"\"))","v":""},{"$f":"IF(F8=\"\",\"\",IF(F8=$AG$7,D8,\"\"))","v":""},{"$f":"IF(F8=\"\",\"\",IF(F8=$AH$7,D8,\"\"))","v":""},{"$f":"IF(C8=614060,1,0)","v":0},{"$f":"IF(AND(C8=615561,D8<>0),1,0)","v":0},{"$f":"IF(OR($B8=\"\",$B8=\"Paste Here\",$B8='[1]Data Sheet'!$E$31),0,1)","v":0},{"$f":"IF(AI8>0,D8,0)","v":0},{"$f":"IF(C8=508300,1,0)","v":0}]
[null,null,null,null,null," ","","","","","","","","","","","","","","","","","","","","","","","","","","","","",0,{"$f":"IF(AND(C9=615561,D9<>0),1,0)","v":0},{"$f":"IF(OR($B9=\"\",$B9='[1]Data Sheet'!$E$31),0,1)","v":0},{"$f":"IF(AI9>0,D9,0)","v":0},{"$f":"IF(C9=508300,1,0)","v":0}]
[null,null,null,null,null," ","","","","","","","","","","","","","","","","","","","","","","","","","","","","",0,0,{"$f":"IF(OR($B10=\"\",$B10='[1]Data Sheet'!$E$31),0,1)","v":0},0,0]
[null,null,null,null,null," ","","","","","","","","","","","","","","","","","","","","","","","","","","","","",0,0,{"$f":"IF(OR($B11=\"\",$B11='[1]Data Sheet'!$E$31),0,1)","v":0},0,0]
[null,null,null,null,null," ","","","","","","","","","","","","","","","","","","","","","","","","","","","","",0,0,{"$f":"IF(OR($B12=\"\",$B12='[1]Data Sheet'!$E$31),0,1)","v":0},0,0]
[null,null,null,null,null," ","","","","","","","","","","","","","","","","","","","","","","","","","","","","",0,0,{"$f":"IF(OR($B13=\"\",$B13='[1]Data Sheet'!$E$31),0,1)","v":0},0,0]
[null,null,null,null,null," ","","","","","","","","","","","","","","","","","","","","","","","","","","","","",0,0,{"$f":"IF(OR($B14=\"\",$B14='[1]Data Sheet'!$E$31),0,1)","v":0},0,0]
[null,null,null,null,null," ","","","","","","","","","","","","","","","","","","","","","","","","","","","","",0,0,{"$f":"IF(OR($B15=\"\",$B15='[1]Data Sheet'!$E$31),0,1)","v":0},0,0]
{"$rows_left_out":993}